Target
Estrogen receptor beta
Ligand
BDBM29608
Substrate
Meas. Tech.
Competitive Binding Assay
IC50
670±n/a nM
Citation
 Gallucci, RRMahood, JAOdle, RRDimond, S Polyetherimide compositions and methods for the manufacture and use thereof US Patent  US9688816 Publication Date 6/27/2017 
Target
Name:
Estrogen receptor beta
Synonyms:
ER-beta ESR2_HUMAN Estradiol receptor beta (ERβ) Estrogen receptor (ER beta) Estrogen receptor beta (ER beta) NR3A2 estrogen beta
Type:
Protein
Mol. Mass.:
59238.43
Organism:
Homo sapiens (Human)
Description:
Q92731
Residue:
530
  
Inhibitor
Name:
BDBM29608
Synonyms:
Bisphenol A (BPA) US9688816, L
Type:
Small organic molecule
Emp. Form.:
C15H16O2
Mol. Mass.:
228.2863
SMILES:
CC(C)(c1ccc(O)cc1)c1ccc(O)cc1
: