Target
Estrogen receptor
Ligand
BDBM50121958
Substrate
Meas. Tech.
Competitive Binding Assay
IC50
>250000±n/a nM
Citation
 Gallucci, RRMahood, JAOdle, RRDimond, S Polyetherimide compositions and methods for the manufacture and use thereof US Patent  US9688816 Publication Date 6/27/2017 
Target
Name:
Estrogen receptor
Synonyms:
ER ESR ESR1_HUMAN Estrogen receptor Estrogen receptor (ER-alpha) Estrogen receptor alpha (ER) Nuclear receptor subfamily 3 group A member 1
Type:
Protein
Mol. Mass.:
66230.44
Organism:
Homo sapiens (Human)
Description:
P03372
Residue:
595
  
Inhibitor
Name:
BDBM50121958
Synonyms:
4,4'-Biphenyldiol 4,4'-biphenol CHEMBL76398 US9688816, 6 biphenyl-4,4'-diol p,p'-dihydroxybiphenyl
Type:
Small organic molecule
Emp. Form.:
C12H10O2
Mol. Mass.:
186.2066
SMILES:
Oc1ccc(cc1)-c1ccc(O)cc1
: