Target
Estrogen receptor beta
Ligand
BDBM25807
Substrate
Meas. Tech.
Competitive Binding Assay
IC50
32000±n/a nM
Citation
 Gallucci, RRMahood, JAOdle, RRDimond, S Polyetherimide compositions and methods for the manufacture and use thereof US Patent  US9688816 Publication Date 6/27/2017 
Target
Name:
Estrogen receptor beta
Synonyms:
ER-beta ESR2_HUMAN Estradiol receptor beta (ERβ) Estrogen receptor (ER beta) Estrogen receptor beta (ER beta) NR3A2 estrogen beta
Type:
Protein
Mol. Mass.:
59238.43
Organism:
Homo sapiens (Human)
Description:
Q92731
Residue:
530
  
Inhibitor
Name:
BDBM25807
Synonyms:
4,4 -Dihydroxybenzophenone Bis(p-hydroxy)benzophenone US9688816, N
Type:
Small organic molecule
Emp. Form.:
C13H10O3
Mol. Mass.:
214.2167
SMILES:
Oc1ccc(cc1)C(=O)c1ccc(O)cc1
: