Target
Estrogen receptor
Ligand
BDBM176768
Substrate
Meas. Tech.
Competitive Binding Assay
IC50
>250000±n/a nM
Citation
 Gallucci, RRMahood, JAOdle, RRDimond, S Polyetherimide compositions and methods for the manufacture and use thereof US Patent  US9688816 Publication Date 6/27/2017 
Target
Name:
Estrogen receptor
Synonyms:
ER ESR ESR1_HUMAN Estrogen receptor Estrogen receptor (ER-alpha) Estrogen receptor alpha (ER) Nuclear receptor subfamily 3 group A member 1
Type:
Protein
Mol. Mass.:
66230.44
Organism:
Homo sapiens (Human)
Description:
P03372
Residue:
595
  
Inhibitor
Name:
BDBM176768
Synonyms:
CAS# 95-71-6 US9688816, 8
Type:
Small organic molecule
Emp. Form.:
C7H8O2
Mol. Mass.:
124.1372
SMILES:
Cc1cc(O)ccc1O
: