Target
Glutamate receptor ionotropic, NMDA 2B
Ligand
BDBM311015
Substrate
Meas. Tech.
Inhibition of Specific Binding to the Rat NR1/NR2B Receptor
IC50
95.1±n/a nM
Citation
 Schindler, RLankau, HHöfgen, NGrunwald, CEgerland, ULangen, BDost, RHage, TWard, S Pyrazoles US Patent  US10155727 Publication Date 12/18/2018 
Target
Name:
Glutamate receptor ionotropic, NMDA 2B
Synonyms:
GluN2B Grin2b NMDA receptor subunit N2B (GluN2B) NMDE2_RAT | NR2B
Type:
Protein
Mol. Mass.:
166077.66
Organism:
Rattus norvegicus (Rat)
Description:
Q00960
Residue:
1482
  
Inhibitor
Name:
BDBM311015
Synonyms:
US10155727, Example 72 | USRE49517, Example 72
Type:
Small organic molecule
Emp. Form.:
C13H11F5N4S
Mol. Mass.:
350.31
SMILES:
FS(F)(F)(F)(F)c1cccc(c1)-c1cnn(Cc2cc[nH]n2)c1
: