Target
Isoform 2 of MAP kinase-interacting serine/threonine-protein kinase 1 (MNK1a) 344D]
Ligand
BDBM176804
Substrate
Meas. Tech.
MKNK1 Kinase High ATP Assay
pH
7.5±n/a
IC50
2750±n/a nM
Comments
extracted
Citation
 Klar, UWortmann, LGraham, KPuehler, FSülzle, DKettschau, GLienau, P Substituted thiazolopyrimidines US Patent  US9675612 Publication Date 6/13/2017 
Target
Name:
Isoform 2 of MAP kinase-interacting serine/threonine-protein kinase 1 (MNK1a) 344D]
Synonyms:
Isoform 2 of MAP kinase-interacting serine/threonine-protein kinase 1 (MNK1a) 344D] MAP kinase signal-integrating kinase 1 (MNK1) (T344D) MAP kinase-interacting serine/threonine-protein kinase 1 (MKNK1) (T344D) MAP kinase-interacting serine/threonine-protein kinase 1 (MNK1a) [T344D] MKNK1 MKNK1_HUMAN MNK1a
Type:
Protein
Mol. Mass.:
47416.00
Organism:
Homo sapiens (Human)
Description:
Q9BUB5-2 with T344D
Residue:
424
  
Inhibitor
Name:
BDBM176804
Synonyms:
US9675612, 41 N-[3-(Dimethylamino)-3-oxopropyl]-N-methyl-7-[(2-oxo-2,3-dihydro-1,3-benzothiazol-6-yl)amino][1,3]thiazolo[5,4-d]pyrimidine-2-carboxamide
Type:
Small organic molecule
Emp. Form.:
C19H19N7O3S2
Mol. Mass.:
457.529
SMILES:
CN(C)C(=O)CCN(C)C(=O)c1nc2c(Nc3ccc4[nH]c(=O)sc4c3)ncnc2s1
: