Target
Renin
Ligand
BDBM212464
Substrate
Meas. Tech.
Inhibitory Activity Against Human Renin
IC50
490±n/a nM
Citation
 Iijima, TSugama, HKawaguchi, TShen, JXia, GXie, JHirai, M Nitrogen-containing saturated heterocyclic compound US Patent  US10155731 Publication Date 12/18/2018 
Target
Name:
Renin
Synonyms:
Angiotensinogenase RENI_HUMAN
Type:
Enzyme
Mol. Mass.:
45058.99
Organism:
Homo sapiens (Human)
Description:
Residue:
406
  
Inhibitor
Name:
BDBM212464
Synonyms:
US10155731, Example 8 | US9278944, 8
Type:
Small organic molecule
Emp. Form.:
C20H24N2O2
Mol. Mass.:
324.4168
SMILES:
C[C@H](N(C1CC1)C(=O)[C@H]1CNCCO1)c1ccc2ccccc2c1
: