Target
Renin
Ligand
BDBM212484
Substrate
Meas. Tech.
Inhibitory Activity Against Human Renin
IC50
3.70±n/a nM
Citation
 Iijima, TSugama, HKawaguchi, TShen, JXia, GXie, JHirai, M Nitrogen-containing saturated heterocyclic compound US Patent  US10155731 Publication Date 12/18/2018 
Target
Name:
Renin
Synonyms:
Angiotensinogenase RENI_HUMAN
Type:
Enzyme
Mol. Mass.:
45058.99
Organism:
Homo sapiens (Human)
Description:
Residue:
406
  
Inhibitor
Name:
BDBM212484
Synonyms:
US10155731, Example 38 | US9278944, 38
Type:
Small organic molecule
Emp. Form.:
C22H31FN4O3
Mol. Mass.:
418.5049
SMILES:
COCCCCn1cc([C@@H](C)N(C2CC2)C(=O)[C@H]2CNCCO2)c2c(F)ccnc12
: