Target
Renin
Ligand
BDBM212495
Substrate
Meas. Tech.
Inhibitory Activity Against Human Renin
IC50
72.0±n/a nM
Citation
 Iijima, TSugama, HKawaguchi, TShen, JXia, GXie, JHirai, M Nitrogen-containing saturated heterocyclic compound US Patent  US10155731 Publication Date 12/18/2018 
Target
Name:
Renin
Synonyms:
Angiotensinogenase RENI_HUMAN
Type:
Enzyme
Mol. Mass.:
45058.99
Organism:
Homo sapiens (Human)
Description:
Residue:
406
  
Inhibitor
Name:
BDBM212495
Synonyms:
US10155731, Example 53 | US9278944, 53
Type:
Small organic molecule
Emp. Form.:
C20H25N3O3
Mol. Mass.:
355.4308
SMILES:
COc1cc(nc2ccccc12)[C@H](C)N(C1CC1)C(=O)[C@H]1CNCCO1
: