Target
Renin
Ligand
BDBM212538
Substrate
Meas. Tech.
Inhibitory Activity Against Human Renin
IC50
2.40±n/a nM
Citation
 Iijima, TSugama, HKawaguchi, TShen, JXia, GXie, JHirai, M Nitrogen-containing saturated heterocyclic compound US Patent  US10155731 Publication Date 12/18/2018 
Target
Name:
Renin
Synonyms:
Angiotensinogenase RENI_HUMAN
Type:
Enzyme
Mol. Mass.:
45058.99
Organism:
Homo sapiens (Human)
Description:
Residue:
406
  
Inhibitor
Name:
BDBM212538
Synonyms:
US10155731, Example 103 | US9278944, 103
Type:
Small organic molecule
Emp. Form.:
C22H30N2O5
Mol. Mass.:
402.484
SMILES:
COCCCOc1cc(cc2ccoc12)[C@@H](C)N(C1CC1)C(=O)[C@H]1CNCCO1
: