Target
Renin
Ligand
BDBM311172
Substrate
Meas. Tech.
Inhibitory Activity Against Human Renin
IC50
3.30±n/a nM
Citation
 Iijima, TSugama, HKawaguchi, TShen, JXia, GXie, JHirai, M Nitrogen-containing saturated heterocyclic compound US Patent  US10155731 Publication Date 12/18/2018 
Target
Name:
Renin
Synonyms:
Angiotensinogenase RENI_HUMAN
Type:
Enzyme
Mol. Mass.:
45058.99
Organism:
Homo sapiens (Human)
Description:
Residue:
406
  
Inhibitor
Name:
BDBM311172
Synonyms:
US10155731, Example 301
Type:
Small organic molecule
Emp. Form.:
C24H38N4O5
Mol. Mass.:
462.5823
SMILES:
COCCCc1cc(cc(CCCNC(=O)OC)n1)[C@@H](C)N(C1CC1)C(=O)[C@H]1CNCCO1
: