Target
Acetylcholinesterase
Ligand
BDBM9347
Substrate
BDBM8959
Meas. Tech.
Enzyme Inhibition Assay
pH
7.4±n/a
Temperature
298.15±n/a K
IC50
4000±n/a nM
Citation
 Shutske, GMPierrat, FAKapples, KJCornfeldt, MLSzewczak, MRHuger, FPBores, GMHaroutunian, VDavis, KL 9-Amino-1,2,3,4-tetrahydroacridin-1-ols: synthesis and evaluation as potential Alzheimer's disease therapeutics. J Med Chem 32:1805-13 (1989)  
Target
Name:
Acetylcholinesterase
Synonyms:
ACES_RAT Acetylcholinesterase and butyrylcholinesterase (AChE and BChE) Acetylcholinesterase, AChE | Ache
Type:
Enzyme
Mol. Mass.:
68193.62
Organism:
Rattus norvegicus (rat)
Description:
P37136
Residue:
614
  
Inhibitor
Name:
BDBM9347
Synonyms:
(2Z)-but-2-enedioic acid; 9-amino-1,2,3,4-tetrahydroacridin-1-ol 9-amino-1,2,3,4-tetrahydroacridin-1-ol maleate CHEMBL51934 | HP-029
Type:
Small organic molecule
Emp. Form.:
C13H14N2O
Mol. Mass.:
214.2631
SMILES:
Nc1c2C(O)CCCc2nc2ccccc12
:
Substrate
Name:
BDBM8959
Synonyms:
(2-Mercaptoethyl)trimethylammonium iodide acetate Acetylthiocholine acetylthiocholine chloride | acetylthiocholine iodide
Type:
Small organic molecule
Emp. Form.:
C7H16NOS
Mol. Mass.:
162.272
SMILES:
CC(=O)SCC[N+](C)(C)C
: