Target
Ribonucleoside-diphosphate reductase large subunit/subunit M2
Ligand
BDBM50017811
Substrate
Meas. Tech.
holoenzyme assay
IC50
148000±7340 nM
Citation
 Horne, DLincoln, C Ribonucleotide reductase inhibitors and methods of use US Patent  US10155732 Publication Date 12/18/2018 
Target
Name:
Ribonucleoside-diphosphate reductase large subunit/subunit M2
Synonyms:
RRM1/RRM2 holoenzyme | Ribonucleoside-diphosphate reductase M1/M2 chain
Type:
Enzyme
Mol. Mass.:
Description:
Components:
This complex has 2 components.
Component 1
Name:
Ribonucleoside-diphosphate reductase large subunit
Synonyms:
RIR1_HUMAN RRM1 Ribonucleoside-diphosphate reductase subunit M1 | Ribonucleotide reductase large subunit
Type:
PROTEIN
Mol. Mass.:
90074.67
Organism:
Homo sapiens (Human)
Description:
ChEMBL_90946
Residue:
792
  
Component 2
Name:
Ribonucleoside-diphosphate reductase subunit M2
Synonyms:
RIR2_HUMAN RRM2 Ribonucleotide reductase small chain | Ribonucleotide reductase small subunit
Type:
PROTEIN
Mol. Mass.:
44868.59
Organism:
Homo sapiens (Human)
Description:
ChEMBL_195255
Residue:
389
  
Inhibitor
Name:
BDBM50017811
Synonyms:
CHEMBL467 US10155732, Compound HU | hydroxyurea
Type:
Small organic molecule
Emp. Form.:
CH4N2O2
Mol. Mass.:
76.0547
SMILES:
NC(=O)NO
: