Target
Ribonucleoside-diphosphate reductase large subunit/subunit M2
Ligand
BDBM310963
Substrate
Meas. Tech.
holoenzyme assay
IC50
9300±2300 nM
Citation
 Horne, DLincoln, C Ribonucleotide reductase inhibitors and methods of use US Patent  US10155732 Publication Date 12/18/2018 
Target
Name:
Ribonucleoside-diphosphate reductase large subunit/subunit M2
Synonyms:
RRM1/RRM2 holoenzyme | Ribonucleoside-diphosphate reductase M1/M2 chain
Type:
Enzyme
Mol. Mass.:
Description:
Components:
This complex has 2 components.
Component 1
Name:
Ribonucleoside-diphosphate reductase large subunit
Synonyms:
RIR1_HUMAN RRM1 Ribonucleoside-diphosphate reductase subunit M1 | Ribonucleotide reductase large subunit
Type:
PROTEIN
Mol. Mass.:
90074.67
Organism:
Homo sapiens (Human)
Description:
ChEMBL_90946
Residue:
792
  
Component 2
Name:
Ribonucleoside-diphosphate reductase subunit M2
Synonyms:
RIR2_HUMAN RRM2 Ribonucleotide reductase small chain | Ribonucleotide reductase small subunit
Type:
PROTEIN
Mol. Mass.:
44868.59
Organism:
Homo sapiens (Human)
Description:
ChEMBL_195255
Residue:
389
  
Inhibitor
Name:
BDBM310963
Synonyms:
US10155732, Compound COH20
Type:
Small organic molecule
Emp. Form.:
C16H12N2O5S
Mol. Mass.:
344.342
SMILES:
Oc1ccc(cc1O)C(=O)Nc1nc(cs1)-c1ccc(O)c(O)c1
: