Target
Orexin/Hypocretin receptor type 1
Ligand
BDBM311102
Substrate
Meas. Tech.
FLIPR Ca2+ Flux Assay
IC50
2843±n/a nM
Citation
 Kuduk, SDLiverton, NLuo, Y Amidoethyl azole orexin receptor antagonists US Patent  US10155750 Publication Date 12/18/2018 
Target
Name:
Orexin/Hypocretin receptor type 1
Synonyms:
HCRTR1 OX1R_HUMAN Orexin receptor type 1 (OR 1) Orexin receptor type 1 (OX1) Orexin receptor type 1 (OxR1) | Ox1r
Type:
Protein
Mol. Mass.:
47554.50
Organism:
Homo sapiens (Human)
Description:
O43613
Residue:
425
  
Inhibitor
Name:
BDBM311102
Synonyms:
2-cyclopropyl-N- ethyl-N-(2-(4-(2- hydroxypropan-2-yl)- 5-methyl-2H-1,2,3- triazol-2-yl)ethyl)-6- methoxynicotinamide | US10155750, Example 39
Type:
Small organic molecule
Emp. Form.:
C20H29N5O3
Mol. Mass.:
387.476
SMILES:
CCN(CCn1nc(C)c(n1)C(C)(C)O)C(=O)c1ccc(OC)nc1C1CC1
: