Target
Orexin receptor type 2
Ligand
BDBM311110
Substrate
Meas. Tech.
FLIPR Ca2+ Flux Assay
IC50
13.0±n/a nM
Citation
 Kuduk, SDLiverton, NLuo, Y Amidoethyl azole orexin receptor antagonists US Patent  US10155750 Publication Date 12/18/2018 
Target
Name:
Orexin receptor type 2
Synonyms:
HCRTR2 OX2R_HUMAN Orexin receptor type 2 (OR-2) Orexin receptor type 2 (OX2R) Ox-2-R | Ox2-R
Type:
Protein
Mol. Mass.:
50710.53
Organism:
Homo sapiens (Human)
Description:
O43614
Residue:
444
  
Inhibitor
Name:
BDBM311110
Synonyms:
N-ethyl-N-(2-(4-(2- hydroxypropan-2-yl)- 5-methyl-2H-1,2,3- triazol-2-yl)ethyl)-2- (1H-pyrazol-1- yl)nicotinamide | US10155750, Example 48
Type:
Small organic molecule
Emp. Form.:
C19H25N7O2
Mol. Mass.:
383.4475
SMILES:
CCN(CCn1nc(C)c(n1)C(C)(C)O)C(=O)c1cccnc1-n1cccn1
: