Target
Receptor-type tyrosine-protein kinase FLT3 [564-960]
Ligand
BDBM311126
Substrate
Meas. Tech.
FLT3 Kinase Test
IC50
5219±n/a nM
Citation
 Hoffmann, MDahmann, GGnamm, CFandrick, DRScott, JMcCarthy, C Pyrazolyl-substituted heteroaryls and their use as medicaments US Patent  US10155751 Publication Date 12/18/2018 
Target
Name:
Receptor-type tyrosine-protein kinase FLT3 [564-960]
Synonyms:
CD135 FLT3 FLT3_HUMAN | STK1
Type:
Enzyme Catalytic Domain
Mol. Mass.:
45855.41
Organism:
Homo sapiens (Human)
Description:
P36888[564-960]
Residue:
397
  
Inhibitor
Name:
BDBM311126
Synonyms:
US10155751, Example 13
Type:
Small organic molecule
Emp. Form.:
C22H29N5O2
Mol. Mass.:
395.498
SMILES:
C[C@@H](Oc1cc(cc2nn(C)c(C)c12)-c1cnn(c1)C(C)(C)C)[C@H]1CNC(=O)C1
: