Target
Sodium channel protein type 9 subunit alpha
Ligand
BDBM311149
Substrate
Meas. Tech.
FLIPR Assays
IC50
797±0.051 nM
Citation
 Yu, J Indazoles and use thereof US Patent  US10155752 Publication Date 12/18/2018 
Target
Name:
Sodium channel protein type 9 subunit alpha
Synonyms:
NENA Peripheral sodium channel 1 SCN9A_HUMAN Voltage-gated sodium channel subunit Nav1.7 hNE-Na
Type:
Protein
Mol. Mass.:
226375.97
Organism:
Homo sapiens (Human)
Description:
Q15858
Residue:
1988
  
Inhibitor
Name:
BDBM311149
Synonyms:
(S)-4-(1,2-dihydroxyethyl)-6-(4- ((7-fluoro-1-methyl-1H-indazol- 4-yl)oxy)phenyl)picolinamide US9834543, Compound 39
Type:
Small organic molecule
Emp. Form.:
C22H19FN4O4
Mol. Mass.:
422.4091
SMILES:
Cn1ncc2c(Oc3ccc(cc3)-c3cc(cc(n3)C(N)=O)[C@H](O)CO)ccc(F)c12
: