Target
AP2-associated protein kinase 1
Ligand
BDBM311160
Substrate
Meas. Tech.
AAK1 Kinase Assay
IC50
0.530±n/a nM
Citation
 Luo, GDzierba, CDMacor, JE Biaryl kinase inhibitors US Patent  US10155760 Publication Date 12/18/2018 
Target
Name:
AP2-associated protein kinase 1
Synonyms:
AAK1 Adaptor-associated kinase 1 | KIAA1048
Type:
PROTEIN
Mol. Mass.:
103884.23
Organism:
Homo sapiens (Human)
Description:
ChEMBL_774569
Residue:
961
  
Inhibitor
Name:
BDBM311160
Synonyms:
(S)-N-(4-(4-((2-amino-4-methylpentyl)oxy)-3-chlorophenyl)pyridin-2-yl)acetamide US10155760, Example 8 US9902722, Example 8
Type:
Small organic molecule
Emp. Form.:
C19H24ClN3O2
Mol. Mass.:
361.866
SMILES:
CC(C)C[C@H](N)COc1ccc(cc1Cl)-c1ccnc(NC(C)=O)c1
: