Target
Histone acetyltransferase KAT2B [719-832]
Ligand
BDBM311410
Substrate
Meas. Tech.
PCAF AlphaLisa Binding Assay
IC50
860±n/a nM
Citation
 Albrecht, BKCote, ACrawford, TDuplessis, MGood, ACLeBlanc, YMagnuson, SNasveschuk, CGPastor, RRomero, AFTaylor, AM Therapeutic compounds and uses thereof US Patent  US10155764 Publication Date 12/18/2018 
Target
Name:
Histone acetyltransferase KAT2B [719-832]
Synonyms:
KAT2B PCAF | PCAF (aa 719-832)
Type:
Enzyme Catalytic Domain
Mol. Mass.:
13623.13
Organism:
Homo sapiens (Human)
Description:
Q92831[719-832]
Residue:
114
  
Inhibitor
Name:
BDBM311410
Synonyms:
US10155764, Example 7A
Type:
Small organic molecule
Emp. Form.:
C13H19N5O
Mol. Mass.:
261.3229
SMILES:
C[C@@H](CNc1nn(C)c(=O)c2cccnc12)N(C)C
: