Target
Interleukin-1 receptor-associated kinase 4
Ligand
BDBM50095466
Substrate
Meas. Tech.
IRAK4 Kinase Assay
IC50
95.0±n/a nM
Citation
 Lim, JAltman, MDChilders, MLGibeau, CRHo, GDTsui, H Carboxamide inhibitors of IRAK4 activity US Patent  US10155765 Publication Date 12/18/2018 
Target
Name:
Interleukin-1 receptor-associated kinase 4
Synonyms:
IRAK-4 IRAK4_HUMAN Interleukin-1 receptor-associated kinase 4 (IRAK4) | Renal carcinoma antigen NY-REN-64
Type:
Protein
Mol. Mass.:
51519.08
Organism:
Homo sapiens (Human)
Description:
Q9NWZ3
Residue:
460
  
Inhibitor
Name:
BDBM50095466
Synonyms:
CHEMBL3590471 | US10155765, Example 12
Type:
Small organic molecule
Emp. Form.:
C17H21N9O2
Mol. Mass.:
383.4077
SMILES:
Cn1cc(NC(=O)c2cnn3ccc(NC4CCCC4N)nc23)c(n1)C(N)=O
: