Target
Interleukin-1 receptor-associated kinase 4
Ligand
BDBM311545
Substrate
Meas. Tech.
IRAK4 Kinase Assay
IC50
33.0±n/a nM
Citation
 Lim, JAltman, MDChilders, MLGibeau, CRHo, GDTsui, H Carboxamide inhibitors of IRAK4 activity US Patent  US10155765 Publication Date 12/18/2018 
Target
Name:
Interleukin-1 receptor-associated kinase 4
Synonyms:
IRAK-4 IRAK4_HUMAN Interleukin-1 receptor-associated kinase 4 (IRAK4) | Renal carcinoma antigen NY-REN-64
Type:
Protein
Mol. Mass.:
51519.08
Organism:
Homo sapiens (Human)
Description:
Q9NWZ3
Residue:
460
  
Inhibitor
Name:
BDBM311545
Synonyms:
N-(3-carbamoyl-1-pyridin-3- yl-1H-pyrazol-4-yl)-5- piperazin-1-ylpyrazolo[1,5- a]pyrimidine-3-carboxamide trifluoroacetate | US10155765, Example 36
Type:
Small organic molecule
Emp. Form.:
C20H20N10O2
Mol. Mass.:
432.4386
SMILES:
NC(=O)c1nn(cc1NC(=O)c1cnn2ccc(nc12)N1CCNCC1)-c1cccnc1
: