Target
Proto-oncogene tyrosine-protein kinase receptor Ret
Ligand
BDBM311600
Substrate
Meas. Tech.
Measurement of Inhibitory Activity Against RET (In Vitro)
IC50
0.200±n/a nM
Citation
 Miyazaki, IShimamura, TKato, MFujita, HIguchi, S Fused pyrimidine compound or salt thereof US Patent  US10155768 Publication Date 12/18/2018 
Target
Name:
Proto-oncogene tyrosine-protein kinase receptor Ret
Synonyms:
CDHF12 Cadherin family member 12 Proto-oncogene c-Ret RET51 Tyrosine-protein kinase Ret (RET)
Type:
Protein
Mol. Mass.:
124318.29
Organism:
Homo sapiens (Human)
Description:
P07949
Residue:
1114
  
Inhibitor
Name:
BDBM311600
Synonyms:
Ex. Cpd. 37 US11046696, Compound 37
Type:
Small organic molecule
Emp. Form.:
C19H21N5OS
Mol. Mass.:
367.468
SMILES:
CSCc1ccc(NC(=O)c2cn(c3ncnc(N)c23)C2(C)CC2)cc1
: