Target
Vascular endothelial growth factor receptor 2
Ligand
BDBM9538
Substrate
poly-Glu-Ala-Tyr
Meas. Tech.
Homogeneous Time-resolved Fluorescence (HTRF) Assay
IC50
51±n/a nM
Citation
 Kiselyov, ASSemenova, MSemenov, VVMilligan, D Inhibitors of VEGF receptors-1 and -2 based on the 2-((pyridin-4-yl)ethyl)pyridine template. Bioorg Med Chem Lett 16:1913-9 (2006)  
Target
Name:
Vascular endothelial growth factor receptor 2
Synonyms:
CD_antigen=CD309 Fetal liver kinase 1 (FLK-1) KDR Protein-tyrosine kinase receptor Flk-1 VEGFR-2 VEGFR2 Vascular Endothelial Growth Factor Receptor Kinase 2 Vascular endothelial growth factor receptor 2 (KDR) Vascular endothelial growth factor receptor 2 (VEGFR2) Vascular endothelial growth factor receptor-2 (VEGFR-2)
Type:
Receptor Tyrosine Kinase
Mol. Mass.:
151510.97
Organism:
Homo sapiens (Human)
Description:
P35968
Residue:
1356
  
Inhibitor
Name:
BDBM9538
Synonyms:
((pyridin-4-yl)ethyl)pyridine 20 | N-[4-(propan-2-yl)phenyl]-5-{2-[2-(pyridin-4-yl)ethyl]pyridin-3-yl}-1,3,4-oxadiazol-2-amine
Type:
Small organic molecule
Emp. Form.:
C23H23N5O
Mol. Mass.:
385.4616
SMILES:
CC(C)c1ccc(Nc2nnc(o2)-c2cccnc2CCc2ccncc2)cc1
:
Substrate
Name:
poly-Glu-Ala-Tyr
Synonyms:
poly-Glu-Ala-Tyr-biotin
Type:
Random Copolymer
Mol. Mass.:
358.43
Organism:
Description:
It is a synthetic polymer of glutamic acid, alanine and tyrosine (poly-Glu-Ala-Tyr) that has been biotinylated.
Residue:
3
NA