Target
Vascular endothelial growth factor receptor 1
Ligand
BDBM9539
Substrate
poly-Glu-Ala-Tyr
Meas. Tech.
Homogeneous Time-resolved Fluorescence (HTRF) Assay
IC50
220±n/a nM
Citation
 Kiselyov, ASSemenova, MSemenov, VVMilligan, D Inhibitors of VEGF receptors-1 and -2 based on the 2-((pyridin-4-yl)ethyl)pyridine template. Bioorg Med Chem Lett 16:1913-9 (2006)  
Target
Name:
Vascular endothelial growth factor receptor 1
Synonyms:
FLT FRT Fms-like tyrosine kinase 1 Tyrosine-protein kinase FRT VEGFR-1 VGFR1_HUMAN Vascular endothelial growth factor receptor 1 (FLT1) Vascular endothelial growth factor receptor 1 and 2 (Flt-1 and KDR) Vascular permeability factor receptor vascular endothelial growth factor/vascular permeability factor receptor
Type:
Receptor Tyrosine Kinase
Mol. Mass.:
150800.23
Organism:
Homo sapiens (Human)
Description:
P17948
Residue:
1338
  
Inhibitor
Name:
BDBM9539
Synonyms:
((pyridin-4-yl)ethyl)pyridine 21 | N-(4-tert-butylphenyl)-5-{3-[2-(pyridin-4-yl)ethyl]pyridin-4-yl}-1,3,4-oxadiazol-2-amine
Type:
Small organic molecule
Emp. Form.:
C24H25N5O
Mol. Mass.:
399.4882
SMILES:
CC(C)(C)c1ccc(Nc2nnc(o2)-c2ccncc2CCc2ccncc2)cc1
:
Substrate
Name:
poly-Glu-Ala-Tyr
Synonyms:
poly-Glu-Ala-Tyr-biotin
Type:
Random Copolymer
Mol. Mass.:
358.43
Organism:
Description:
It is a synthetic polymer of glutamic acid, alanine and tyrosine (poly-Glu-Ala-Tyr) that has been biotinylated.
Residue:
3
NA