Target
Voltage-dependent calcium channel gamma-2 subunit
Ligand
BDBM311817
Substrate
Meas. Tech.
Calcium Flux Assay
IC50
39.8±n/a nM
Citation
 Ameriks, MKLaforteza, BNLebold, TPRavula, SSavall, BMShireman, BT Fused azaheterocyclic compounds and their use as AMPA receptor modulators US Patent  US10155769 Publication Date 12/18/2018 
Target
Name:
Voltage-dependent calcium channel gamma-2 subunit
Synonyms:
CACNG2 Neuronal voltage-gated calcium channel gamma-2 subunit Transmembrane AMPAR regulatory protein gamma-2
Type:
Enzyme Catalytic Domain
Mol. Mass.:
35977.54
Organism:
Homo sapiens (Human)
Description:
Residue:
323
  
Inhibitor
Name:
BDBM311817
Synonyms:
7-Methyl-5-(7-methyl-2-phenyl-imidazo[1,2-a]pyridin-8-yl)indolin-2-one | US10155769, Example 55
Type:
Small organic molecule
Emp. Form.:
C23H19N3O
Mol. Mass.:
353.4165
SMILES:
Cc1cc(cc2CC(=O)Nc12)-c1c(C)ccn2cc(nc12)-c1ccccc1
: