Target
Dipeptidyl peptidase 4
Ligand
BDBM311857
Substrate
Meas. Tech.
DPP-IV Inhibitory Activity
IC50
18.2±n/a nM
Citation
 Xu, XShen, YXiao, DLuo, HPeng, YHan, YZhang, AYang, L Substituted amino six-membered saturated heteroalicycles as long-acting DPP-IV inhibitors US Patent  US10155775 Publication Date 12/18/2018 
Target
Name:
Dipeptidyl peptidase 4
Synonyms:
ADABP Adenosine deaminase complexing protein 2 CD_antigen=CD26 DPP4 DPPIV Dipeptidyl peptidase 4 (DPP IV) Dipeptidyl peptidase 4 (DPP4) Dipeptidyl peptidase 4 membrane form Dipeptidyl peptidase IV Dipeptidyl peptidase IV (DDP-IV) Dipeptidyl peptidase IV membrane form Dipeptidyl peptidase-IV (DPP-4) T-cell activation antigen CD26 | TP103
Type:
Enzyme
Mol. Mass.:
88271.01
Organism:
Homo sapiens (Human)
Description:
P27487
Residue:
766
  
Inhibitor
Name:
BDBM311857
Synonyms:
US10155775, Example 3
Type:
Small organic molecule
Emp. Form.:
C18H18F2N2O3S
Mol. Mass.:
380.409
SMILES:
N[C@H]1C[C@H](CO[C@@H]1c1cc(F)ccc1F)N1Cc2cc(sc2C1)C(O)=O
: