Target
Somatostatin receptor type 4
Ligand
BDBM311969
Substrate
Meas. Tech.
AMP Assay with Human Somatostatin 4 Receptor
EC50
0.400±n/a nM
Citation
 Giovannini, RCui, YDoods, HFerrara, MJust, SKuelzer, RLingard, IMazzaferro, RRudolf, K Somatostatin receptor subtype 4 (SSTR4) agonists US Patent  US10166214 Publication Date 1/1/2019 
Target
Name:
Somatostatin receptor type 4
Synonyms:
SOMATOSTATIN SST4 SS4-R SSR4_HUMAN SSTR4 | Somatostatin receptor type 4 (SSTR4)
Type:
Enzyme
Mol. Mass.:
42015.38
Organism:
Homo sapiens (Human)
Description:
P31391
Residue:
388
  
Inhibitor
Name:
BDBM311969
Synonyms:
US10166214, Example 105 | US10675268, Example 105
Type:
Small organic molecule
Emp. Form.:
C17H21FN4O
Mol. Mass.:
316.3732
SMILES:
Cn1nc(c2cccc(F)c12)C(C)(C)NC(=O)[C@@H]1[C@H]2CNC[C@@H]12
: