Target
Somatostatin receptor type 3
Ligand
BDBM311911
Substrate
Meas. Tech.
Radiogland Binding Assays
Ki
>8618±n/a nM
Citation
 Giovannini, RCui, YDoods, HFerrara, MJust, SKuelzer, RLingard, IMazzaferro, RRudolf, K Somatostatin receptor subtype 4 (SSTR4) agonists US Patent  US10166214 Publication Date 1/1/2019 
Target
Name:
Somatostatin receptor type 3
Synonyms:
SOMATOSTATIN SST3 SS3-R SSR-28 SSTR3 | Somatostatin receptor type 3 (SSTR3)
Type:
Protein
Mol. Mass.:
45855.97
Organism:
Homo sapiens (Human)
Description:
P32745
Residue:
418
  
Inhibitor
Name:
BDBM311911
Synonyms:
US10166214, Example 47 US11834435, Example 3 | US9789082, Example 47
Type:
Small organic molecule
Emp. Form.:
C16H23N3O2
Mol. Mass.:
289.3727
SMILES:
Cc1cccnc1OCC(C)(C)NC(=O)[C@@H]1[C@H]2CNC[C@@H]12
: