Target
Somatostatin receptor type 4
Ligand
BDBM312012
Substrate
Meas. Tech.
Radiogland Binding Assays
Ki
32.3±n/a nM
Citation
 Giovannini, RCui, YDoods, HFerrara, MJust, SKuelzer, RLingard, IMazzaferro, RRudolf, K Somatostatin receptor subtype 4 (SSTR4) agonists US Patent  US10166214 Publication Date 1/1/2019 
Target
Name:
Somatostatin receptor type 4
Synonyms:
SOMATOSTATIN SST4 SS4-R SSR4_HUMAN SSTR4 | Somatostatin receptor type 4 (SSTR4)
Type:
Enzyme
Mol. Mass.:
42015.38
Organism:
Homo sapiens (Human)
Description:
P31391
Residue:
388
  
Inhibitor
Name:
BDBM312012
Synonyms:
US10166214, Example 148 US9789082, Example 148
Type:
Small organic molecule
Emp. Form.:
C19H24N4O
Mol. Mass.:
324.4201
SMILES:
Cc1nc(c2cccc(C)c2n1)C(C)(C)NC(=O)[C@@H]1[C@H]2CNC[C@@H]12
: