Target
Membrane primary amine oxidase
Ligand
BDBM309464
Substrate
Meas. Tech.
Inhibitory Assay
IC50
1.20±n/a nM
Citation
 Matsukawa, TMasuzaki, KKawasaki, AAkasaka, AKawai, Y Benzene or thiophene derivative and use thereof as VAP-1 inhibitor US Patent  US9603833 Publication Date 3/28/2017 
Target
Name:
Membrane primary amine oxidase
Synonyms:
AOC3_RAT Aoc3 Vascular adhesion protein 1 (VAP-1)
Type:
Enzyme
Mol. Mass.:
84979.78
Organism:
Rattus norvegicus (Rat)
Description:
O08590
Residue:
763
  
Inhibitor
Name:
BDBM309464
Synonyms:
US9603833, Example 45
Type:
Small organic molecule
Emp. Form.:
C20H26N4O
Mol. Mass.:
338.4466
SMILES:
NNC(=O)Cc1ccc(CCc2ccc(nc2)N2CCCCC2)cc1
: