Target
Membrane primary amine oxidase
Ligand
BDBM309479
Substrate
Meas. Tech.
Inhibitory Assay
IC50
0.800±n/a nM
Citation
 Matsukawa, TMasuzaki, KKawasaki, AAkasaka, AKawai, Y Benzene or thiophene derivative and use thereof as VAP-1 inhibitor US Patent  US9603833 Publication Date 3/28/2017 
Target
Name:
Membrane primary amine oxidase
Synonyms:
AOC3_RAT Aoc3 Vascular adhesion protein 1 (VAP-1)
Type:
Enzyme
Mol. Mass.:
84979.78
Organism:
Rattus norvegicus (Rat)
Description:
O08590
Residue:
763
  
Inhibitor
Name:
BDBM309479
Synonyms:
US9603833, Example 92
Type:
Small organic molecule
Emp. Form.:
C21H30N4O
Mol. Mass.:
354.4891
SMILES:
CCCN(CCC)c1ccc(CCc2ccc(CC(=O)NN)cc2)cn1
: