Target
Membrane primary amine oxidase
Ligand
BDBM309489
Substrate
Meas. Tech.
Inhibitory Assay
IC50
0.400±n/a nM
Citation
 Matsukawa, TMasuzaki, KKawasaki, AAkasaka, AKawai, Y Benzene or thiophene derivative and use thereof as VAP-1 inhibitor US Patent  US9603833 Publication Date 3/28/2017 
Target
Name:
Membrane primary amine oxidase
Synonyms:
AOC3_RAT Aoc3 Vascular adhesion protein 1 (VAP-1)
Type:
Enzyme
Mol. Mass.:
84979.78
Organism:
Rattus norvegicus (Rat)
Description:
O08590
Residue:
763
  
Inhibitor
Name:
BDBM309489
Synonyms:
US9603833, Example 111
Type:
Small organic molecule
Emp. Form.:
C21H27N5O3
Mol. Mass.:
397.4708
SMILES:
CC(=O)N1CCN(CC1)c1ccc(CCc2cccc(COC(=O)NN)c2)nc1
: