Target
C-C chemokine receptor type 2
Ligand
BDBM309518
Substrate
Meas. Tech.
FLIPR Assay
IC50
306±n/a nM
Citation
 Yuan, HBeard, RLGarst, MELiu, XDonello, JEViswanath, V 1,2- bis-sulfonamide derivatives as chemokine receptor modulators US Patent  US9603834 Publication Date 3/28/2017 
Target
Name:
C-C chemokine receptor type 2
Synonyms:
C-C chemokine receptor type 2 (CCR2) CCR2_HUMAN Chemoattractant Cytokine Receptor 2 (CCR2) Monocyte chemotactic protein-1 (MCP-1)
Type:
Enzyme
Mol. Mass.:
41932.32
Organism:
Homo sapiens (Human)
Description:
P41597
Residue:
374
  
Inhibitor
Name:
BDBM309518
Synonyms:
N-[4,5-dichloro-2-({[3-(trifluoromethyl)phenyl]sulfonyl}amino)phenyl]thiophene-2-sulfonamide | US9603834, 17
Type:
Small organic molecule
Emp. Form.:
C17H11Cl2F3N2O4S3
Mol. Mass.:
531.376
SMILES:
FC(F)(F)c1cccc(c1)S(=O)(=O)Nc1cc(Cl)c(Cl)cc1NS(=O)(=O)c1cccs1
: