Target
Dimer of Gag-Pol polyprotein [489-587]
Ligand
BDBM9675
Substrate
Chromogenic Peptide Substrate
Meas. Tech.
Protease Inhibition Assay
Ki
9±n/a nM
Citation
 Melnick, MReich, SHLewis, KKMitchell, LJNguyen, DTrippe, AJDawson, HDavies, JFAppelt, KWu, BWMusick, LGehlhaar, DKWebber, SShetty, BKosa, MKahil, DAndrada, D Bis tertiary amide inhibitors of the HIV-1 protease generated via protein structure-based iterative design. J Med Chem 39:2795-811 (1996)  
Target
Name:
Dimer of Gag-Pol polyprotein [489-587]
Synonyms:
HIV-1 Protease
Type:
Protein Complex
Mol. Mass.:
Description:
Components:
This complex has 2 components.
Component 1
Name:
Gag-Pol polyprotein [489-587]
Synonyms:
HIV protease HIV-1 Protease chain A POL_HV1N5 | gag-pol
Type:
Enzyme Subunit
Mol. Mass.:
10822.21
Organism:
Human immunodeficiency virus type 1
Description:
P12497[489-587]
Residue:
99
  
Component 2
Name:
Gag-Pol polyprotein [489-587]
Synonyms:
HIV protease HIV-1 Protease chain A POL_HV1N5 | gag-pol
Type:
Enzyme Subunit
Mol. Mass.:
10822.21
Organism:
Human immunodeficiency virus type 1
Description:
P12497[489-587]
Residue:
99
  
Inhibitor
Name:
BDBM9675
Synonyms:
2-(4-{2-[(1-ethylcyclopentyl)(2-hydroxyethyl)carbamoyl]phenyl}-2-hydroxybutyl)-N-(2-hydroxyethyl)-5-methyl-N-(2-{4-[2-(morpholin-4-yl)ethoxy]phenyl}propan-2-yl)benzamide Tertiary Amide deriv. 62
Type:
Small organic molecule
Emp. Form.:
C45H63N3O7
Mol. Mass.:
757.9976
SMILES:
CCC1(CCCC1)N(CCO)C(=O)c1ccccc1CCC(O)Cc1ccc(C)cc1C(=O)N(CCO)C(C)(C)c1ccc(OCCN2CCOCC2)cc1
:
Substrate
Name:
Chromogenic Peptide Substrate
Synonyms:
Type:
Peptide
Mol. Mass.:
3763.66
Organism:
Description:
Residue:
35