Target
Bromodomain-containing protein 4 [368-440]
Ligand
BDBM179458
Substrate
Meas. Tech.
FP Competitive Binding Assay (BRD-1F)
pH
7.5±n/a
Temperature
298.15±n/a K
Ki
232±n/a nM
IC50
873±n/a nM
Comments
extracted
Citation
 Wang, SRan, XZhao, YYang, CLiu, LBai, LMcEachern, DStuckey, JMeagher, JLSun, DLi, XZhou, BKaratas, HLuo, RChinnaiyan, AAsangani, IA BET bromodomain inhibitors and therapeutic methods using the same US Patent  US9675697 Publication Date 6/13/2017 
Target
Name:
Bromodomain-containing protein 4 [368-440]
Synonyms:
BRD4 Bromo domain 2 Bromodomain-containing protein 4 (BRD4) Bromo 2 Bromodomain-containing protein 4 (BRD4)(Bromo 2) Bromodomain-containing protein 4 Bromodomain 2 (BRD4-2) HUNK1
Type:
Protein
Mol. Mass.:
8564.63
Organism:
Homo sapiens (Human)
Description:
BD2 (368-440 aa) of O60885
Residue:
73
  
Inhibitor
Name:
BDBM179458
Synonyms:
US9675697, Cpd. No. 4
Type:
Small organic molecule
Emp. Form.:
C22H18N4O2
Mol. Mass.:
370.4039
SMILES:
COc1cc2c(cc1-c1c(C)noc1C)[nH]c1ccnc(-c3cccnc3)c21
: