Target
Bromodomain-containing protein 2 [364-436]
Ligand
BDBM179474
Substrate
Meas. Tech.
FP Competitive Binding Assay (No.350)
Temperature
298.15±n/a K
Ki
38±2.20 nM
Comments
extracted
Citation
 Wang, SRan, XZhao, YYang, CLiu, LBai, LMcEachern, DStuckey, JMeagher, JLSun, DLi, XZhou, BKaratas, HLuo, RChinnaiyan, AAsangani, IA BET bromodomain inhibitors and therapeutic methods using the same US Patent  US9675697 Publication Date 6/13/2017 
Target
Name:
Bromodomain-containing protein 2 [364-436]
Synonyms:
BRD2 Bromodomain-containing protein 2 (BRD2)(BD2) KIAA9001 | RING3
Type:
Protein
Mol. Mass.:
8615.14
Organism:
Homo sapiens (Human)
Description:
BD2 (364-436 aa) of P25440
Residue:
73
  
Inhibitor
Name:
BDBM179474
Synonyms:
US9675697, Cpd. No. 25
Type:
Small organic molecule
Emp. Form.:
C27H22N5O2
Mol. Mass.:
448.4959
SMILES:
COc1cc2c(cc1-c1c(C)noc1C)[nH]c1ccnc(-c3c(C)nnc3-c3ccccc3)c21
: