Target
Indoleamine 2,3-dioxygenase 1
Ligand
BDBM312086
Substrate
Meas. Tech.
Assay for IDO1 Enzymatic Activity Determination
IC50
1700±n/a nM
Citation
 Crosignani, SCauwenberghs, SDriessens, GDeroose, F Pyrrolidine-2, 5-dione derivatives, pharmaceutical compositions and methods for use as IDO1 inhibitors US Patent  US9603836 Publication Date 3/28/2017 
Target
Name:
Indoleamine 2,3-dioxygenase 1
Synonyms:
I23O1_HUMAN IDO-1 INDO Indoleamine 2,3-dioxygenase | Indoleamine-pyrrole 2,3-dioxygenase
Type:
Enzyme
Mol. Mass.:
45330.80
Organism:
Homo sapiens (Human)
Description:
P14902
Residue:
403
  
Inhibitor
Name:
BDBM312086
Synonyms:
3-(2,5-dioxopyrrolidin- 3-yl)-1H-indole-6- carbonitrile | US9603836, Compound 22
Type:
Small organic molecule
Emp. Form.:
C13H9N3O2
Mol. Mass.:
239.2295
SMILES:
O=C1CC(C(=O)N1)c1c[nH]c2cc(ccc12)[N+]#[C-]
: