Target
Genome polyprotein
Ligand
BDBM9734
Substrate
NS3-NS4A Chromogenic Peptide Substrate
Meas. Tech.
Continuous Spectrophotometric Assay
pH
6.5±n/a
Temperature
303.15±n/a K
Ki
69000±n/a nM
Km
19000±1000 nM
Comments
The substrate is hydrolyzed by HCV protease with a second-order rate constant (kcat/Km) of 80,000 +/- 10,000 M-1sec-1.
Citation
 Arasappan, ANjoroge, FGParekh, TNYang, XPichardo, JButkiewicz, NProngay, AYao, NGirijavallabhan, V Novel 2-oxoimidazolidine-4-carboxylic acid derivatives as hepatitis C virus NS3-4A serine protease inhibitors: synthesis, activity, and X-ray crystal structure of an enzyme inhibitor complex. Bioorg Med Chem Lett 14:5751-5 (2004)  
Target
Name:
Genome polyprotein
Synonyms:
Dipeptidyl peptidase 4 (DPP4) NS3 NS5B NS3-4A Protease NS3/4A protease POLG_HCV77 | RNA polymerase (NS5B)
Type:
Protease Domain
Mol. Mass.:
327221.49
Organism:
Hepatitis C virus (HCV genotype 1a, isolate H)
Description:
P27958
Residue:
3011
  
Inhibitor
Name:
BDBM9734
Synonyms:
2-oxoimidazolidine-4-carboxylic acid deriv. 7 | tert-butyl (4S)-4-{[(1S)-4-(tert-butoxy)-1-{[(1S)-2-methyl-1-{[(2S)-3-methyl-1-oxo-1-[(5S)-2-oxo-5-{[1-oxo-1-(prop-2-en-1-ylcarbamoyl)pentan-2-yl]carbamoyl}imidazolidin-1-yl]butan-2-yl]carbamoyl}propyl]carbamoyl}-4-oxobutyl]carbamoyl}-4-acetamidobutanoate
Type:
Small organic molecule
Emp. Form.:
C43H70N8O13
Mol. Mass.:
907.0617
SMILES:
CCCC(NC(=O)[C@@H]1CNC(=O)N1C(=O)[C@@H](NC(=O)[C@@H](NC(=O)[C@H](CCC(=O)OC(C)(C)C)NC(=O)[C@H](CCC(=O)OC(C)(C)C)NC(C)=O)C(C)C)C(C)C)C(=O)C(=O)NCC=C
:
Substrate
Name:
NS3-NS4A Chromogenic Peptide Substrate
Synonyms:
Type:
Peptide
Mol. Mass.:
1366.94
Organism:
Description:
The 4-phenylazophenol (PAP) chromophore was incorporated to improve assay sensitivity.
Residue:
13
ACDTEDVVPNVAH