Target
Genome polyprotein
Ligand
BDBM9749
Substrate
NS3-NS4A Chromogenic Peptide Substrate
Meas. Tech.
Continuous Spectrophotometric Assay
pH
6.5±n/a
Temperature
303.15±n/a K
Ki
3800±n/a nM
Km
19000±1000 nM
Comments
The substrate is hydrolyzed by HCV protease with a second-order rate constant (kcat/Km) of 80,000 +/- 10,000 M-1sec-1.
Citation
 Venkatraman, SNjoroge, FGWu, WGirijavallabhan, VProngay, AJButkiewicz, NPichardo, J Novel inhibitors of hepatitis C NS3-NS4A serine protease derived from 2-aza-bicyclo[2.2.1]heptane-3-carboxylic acid. Bioorg Med Chem Lett 16:1628-32 (2006)  
Target
Name:
Genome polyprotein
Synonyms:
Dipeptidyl peptidase 4 (DPP4) NS3 NS5B NS3-4A Protease NS3/4A protease POLG_HCV77 | RNA polymerase (NS5B)
Type:
Protease Domain
Mol. Mass.:
327221.49
Organism:
Hepatitis C virus (HCV genotype 1a, isolate H)
Description:
P27958
Residue:
3011
  
Inhibitor
Name:
BDBM9749
Synonyms:
2-(3-{[(3S)-2-[(2S)-2-{[(tert-butoxy)carbonyl]amino}-3,3-dimethylbutanoyl]-2-azabicyclo[2.2.1]heptan-3-yl]formamido}-2-oxohexanamido)acetic acid | 2-aza-bicyclo[2.2.1]heptane-3-carboxylic acid deriv. 13
Type:
Small organic molecule
Emp. Form.:
C26H42N4O8
Mol. Mass.:
538.6337
SMILES:
CCCC(NC(=O)[C@@H]1C2CCC(C2)N1C(=O)[C@@H](NC(=O)OC(C)(C)C)C(C)(C)C)C(=O)C(=O)NCC(O)=O
:
Substrate
Name:
NS3-NS4A Chromogenic Peptide Substrate
Synonyms:
Type:
Peptide
Mol. Mass.:
1366.94
Organism:
Description:
The 4-phenylazophenol (PAP) chromophore was incorporated to improve assay sensitivity.
Residue:
13
ACDTEDVVPNVAH