Target
Sigma non-opioid intracellular receptor 1
Ligand
BDBM312169
Substrate
Meas. Tech.
Receptor Assay
Ki
4.04±0.35 nM
Citation
 McCurdy, CRMesangeau, CChin, FTJames, MLShen, BGambhir, S Highly selective sigma receptor radioligands US Patent  US9604926 Publication Date 3/28/2017 
Target
Name:
Sigma non-opioid intracellular receptor 1
Synonyms:
Opioid receptor, sigma 1 SGMR1_MOUSE Sigma1-receptor Sigmar1
Type:
Enzyme Catalytic Domain
Mol. Mass.:
25246.51
Organism:
Mus musculus (Mouse)
Description:
O55242
Residue:
223
  
Inhibitor
Name:
BDBM312169
Synonyms:
US9604926, Compound CM-174 | US9724435, Compound CM-174
Type:
Small organic molecule
Emp. Form.:
C23H35N3O2
Mol. Mass.:
385.5429
SMILES:
CCc1ccc2oc(=O)n(CCCCN3CCN(CC3)C3CCCCC3)c2c1
: