Target
Sodium-dependent dopamine transporter
Ligand
BDBM312195
Substrate
Meas. Tech.
Norepinephrine Transporter Binding Assay
Ki
40000±n/a nM
Citation
 Chen, HLiu, MSu, QRaisinghani, M Sydnonimines-specific dopamine reuptake inhibitors and their use in treating dopamine related disorders US Patent  US9604945 Publication Date 3/28/2017 
Target
Name:
Sodium-dependent dopamine transporter
Synonyms:
DA transporter DAT1 Dopamine transporter protein (DAT) SC6A3_HUMAN Sodium-dependent dopamine transporter Solute carrier family 6 member 3
Type:
Multi-pass membrane protein
Mol. Mass.:
68497.11
Organism:
Homo sapiens (Human)
Description:
Q01959
Residue:
620
  
Inhibitor
Name:
BDBM312195
Synonyms:
3-phenethyl- syndonimine-N- (3',4'-dichlorophenyl) carbamoyl | US9604945, 4
Type:
Small organic molecule
Emp. Form.:
C17H16Cl2N4O2
Mol. Mass.:
379.241
SMILES:
Clc1ccc(NC(=O)\N=C2/CN(CCc3ccccc3)NO2)cc1Cl
: