Target
Sodium-dependent noradrenaline transporter
Ligand
BDBM159332
Substrate
Meas. Tech.
NET Radioligand Binding Assay
IC50
86±n/a nM
Citation
 Liu, SMolino, BFNacro, K Aryl, heteroaryl, and heterocycle substituted tetrahydroisoquinolines and use thereof US Patent  US9604960 Publication Date 3/28/2017 
Target
Name:
Sodium-dependent noradrenaline transporter
Synonyms:
Monoamine transporter NET Noradrenaline Transporter (NET) Norepinephrine transporter protein (NET) SLC6A2 Sodium-dependent noradrenaline transporter (NET) | Solute carrier family 6 member 2
Type:
Multi-pass membrane protein
Mol. Mass.:
69337.72
Organism:
Homo sapiens (Human)
Description:
P23975
Residue:
617
  
Inhibitor
Name:
BDBM159332
Synonyms:
US9034899, 15 | US9604960, 15
Type:
Small organic molecule
Emp. Form.:
C22H16Cl2N2
Mol. Mass.:
379.282
SMILES:
Clc1ccc(cc1Cl)C1CNCc2cc(ccc12)-c1cccc(c1)C#N
: