Target
Sodium-dependent dopamine transporter
Ligand
BDBM159345
Substrate
Meas. Tech.
DAT Radioligand Binding Assay
IC50
31±n/a nM
Citation
 Liu, SMolino, BFNacro, K Aryl, heteroaryl, and heterocycle substituted tetrahydroisoquinolines and use thereof US Patent  US9604960 Publication Date 3/28/2017 
Target
Name:
Sodium-dependent dopamine transporter
Synonyms:
DA transporter DAT1 Dopamine transporter protein (DAT) SC6A3_HUMAN Sodium-dependent dopamine transporter Solute carrier family 6 member 3
Type:
Multi-pass membrane protein
Mol. Mass.:
68497.11
Organism:
Homo sapiens (Human)
Description:
Q01959
Residue:
620
  
Inhibitor
Name:
BDBM159345
Synonyms:
US9034899, 36 US9604960, 36
Type:
Small organic molecule
Emp. Form.:
C21H16Cl2N4
Mol. Mass.:
395.285
SMILES:
Clc1ccc(cc1Cl)C1CNCc2cc(ccc12)-c1ccc2ncnn2c1
: