Target
Sodium-dependent dopamine transporter
Ligand
BDBM159346
Substrate
Meas. Tech.
DAT Radioligand Binding Assay
IC50
83±n/a nM
Citation
 Liu, SMolino, BFNacro, K Aryl, heteroaryl, and heterocycle substituted tetrahydroisoquinolines and use thereof US Patent  US9604960 Publication Date 3/28/2017 
Target
Name:
Sodium-dependent dopamine transporter
Synonyms:
DA transporter DAT1 Dopamine transporter protein (DAT) SC6A3_HUMAN Sodium-dependent dopamine transporter Solute carrier family 6 member 3
Type:
Multi-pass membrane protein
Mol. Mass.:
68497.11
Organism:
Homo sapiens (Human)
Description:
Q01959
Residue:
620
  
Inhibitor
Name:
BDBM159346
Synonyms:
US9034899, 39 | US9604960, 39
Type:
Small organic molecule
Emp. Form.:
C21H15Cl2FN4
Mol. Mass.:
413.275
SMILES:
Fc1cc2C(CNCc2cc1-c1ccc2ncnn2c1)c1ccc(Cl)c(Cl)c1
: