Target
Aromatase
Ligand
BDBM9911
Substrate
BDBM8592
Meas. Tech.
CYP19 Assay
pH
7±n/a
Temperature
310.15±n/a K
Ki
39±5 nM
IC50
79±n/a nM
Km
77±9 nM
Citation
 Su, BHackett, JCDiaz-Cruz, ESKim, YWBrueggemeier, RW Lead optimization of 7-benzyloxy 2-(4'-pyridylmethyl)thio isoflavone aromatase inhibitors. Bioorg Med Chem 13:6571-7 (2005)  
Target
Name:
Aromatase
Synonyms:
ARO1 CP19A_HUMAN CYP19 CYPXIX Cytochrome P450 19A1 Cytochrome P450-C19 (CYP19) FL cytokine receptor precursor | P-450AROM
Type:
Enzyme
Mol. Mass.:
57888.92
Organism:
Homo sapiens (Human)
Description:
P11511
Residue:
503
  
Inhibitor
Name:
BDBM9911
Synonyms:
3-Phenyl-7-(4-biphenylmethoxy)-2-[(4-pyridylmethyl)thio]-4H-1-benzopyran-4-one isoflavone deriv. 5m
Type:
Small organic molecule
Emp. Form.:
C34H25NO3S
Mol. Mass.:
527.632
SMILES:
O=c1c(-c2ccccc2)c(SCc2ccncc2)oc2cc(OCc3ccc(cc3)-c3ccccc3)ccc12
:
Substrate
Name:
BDBM8592
Synonyms:
(2R,15S)-2,15-dimethyltetracyclo[8.7.0.0^{2,7}.0^{11,15}]heptadec-6-ene-5,14-dione Androst-4-ene-3,17-dione [1beta-3H] androstenedione
Type:
Small organic molecule
Emp. Form.:
C19H26O2
Mol. Mass.:
286.4085
SMILES:
C[C@]12CCC3C(CCC4=CC(=O)CC[C@]34C)C1CCC2=O
: