Target
Prostaglandin E2 receptor EP4 subtype
Ligand
BDBM179985
Substrate
Meas. Tech.
SEAP Activity Assay
EC50
32±n/a nM
Citation
 Barrett, SDGermain, BDUzieblo, ACiske, FLEndres, GWKornilov, AMaxey, KMO'Malley, JPOwen, TA Lactam compounds as EP4 receptor-selective agonists for use in the treatment of EP4-mediated diseases and conditions US Patent  US9676712 Publication Date 6/13/2017 
Target
Name:
Prostaglandin E2 receptor EP4 subtype
Synonyms:
PE2R4_HUMAN PGE2 receptor EP4 subtype PTGER4 Prostanoid EP4 receptor
Type:
Enzyme
Mol. Mass.:
53134.53
Organism:
Homo sapiens (Human)
Description:
P35408
Residue:
488
  
Inhibitor
Name:
BDBM179985
Synonyms:
US9676712, 3D
Type:
Small organic molecule
Emp. Form.:
C26H29NO4S
Mol. Mass.:
451.578
SMILES:
CC(CCCc1ccccc1)[C@H](O)\C=C\[C@H]1CCC(=O)N1CC#Cc1ccc(s1)C(O)=O
: