Target
Aromatase
Ligand
BDBM9979
Substrate
BDBM8592
Meas. Tech.
Aromatase Assay
Ki
100000±n/a nM
IC50
>50000±n/a nM
Citation
 Numazawa, MKamiyama, TTachibana, MOshibe, M Synthesis and structure-activity relationships of 6-substituted androst-4-ene analogs as aromatase inhibitors. J Med Chem 39:2245-52 (1996)  
Target
Name:
Aromatase
Synonyms:
ARO1 CP19A_HUMAN CYP19 CYPXIX Cytochrome P450 19A1 Cytochrome P450-C19 (CYP19) FL cytokine receptor precursor | P-450AROM
Type:
Enzyme
Mol. Mass.:
57888.92
Organism:
Homo sapiens (Human)
Description:
P11511
Residue:
503
  
Inhibitor
Name:
BDBM9979
Synonyms:
(8R)-2,15-dimethyl-8-pentyltetracyclo[8.7.0.0^{2,7}.0^{11,15}]heptadec-6-en-14-ol | 6-Substituted Androst-4-ene Analog 15d
Type:
Small organic molecule
Emp. Form.:
C24H40O
Mol. Mass.:
344.5738
SMILES:
CCCCC[C@@H]1CC2C3CCC(O)C3(C)CCC2C2(C)CCCC=C12
:
Substrate
Name:
BDBM8592
Synonyms:
(2R,15S)-2,15-dimethyltetracyclo[8.7.0.0^{2,7}.0^{11,15}]heptadec-6-ene-5,14-dione Androst-4-ene-3,17-dione [1beta-3H] androstenedione
Type:
Small organic molecule
Emp. Form.:
C19H26O2
Mol. Mass.:
286.4085
SMILES:
C[C@]12CCC3C(CCC4=CC(=O)CC[C@]34C)C1CCC2=O
: