Target
Aromatase
Ligand
BDBM9987
Substrate
BDBM8592
Meas. Tech.
Aromatase Assay
pH
7.5±n/a
Temperature
310.15±n/a K
Ki
25±n/a nM
IC50
280±n/a nM
Km
33±n/a nM
Citation
 Numazawa, MYamada, KNitta, SSasaki, CKidokoro, K Role of hydrophilic interaction in binding of hydroxylated 3-deoxy C(19) steroids to the active site of aromatase. J Med Chem 44:4277-83 (2001)  
Target
Name:
Aromatase
Synonyms:
ARO1 CP19A_HUMAN CYP19 CYPXIX Cytochrome P450 19A1 Cytochrome P450-C19 (CYP19) FL cytokine receptor precursor | P-450AROM
Type:
Enzyme
Mol. Mass.:
57888.92
Organism:
Homo sapiens (Human)
Description:
P11511
Residue:
503
  
Inhibitor
Name:
BDBM9987
Synonyms:
(2R,6S,15S)-6-hydroxy-2,15-dimethyltetracyclo[8.7.0.0^{2,7}.0^{11,15}]heptadec-7-en-14-one Hydroxylated 3-Deoxy C19 Steroid 8
Type:
Small organic molecule
Emp. Form.:
C19H28O2
Mol. Mass.:
288.4244
SMILES:
C[C@]12CCC3C(CC=C4[C@@H](O)CCC[C@]34C)C1CCC2=O
:
Substrate
Name:
BDBM8592
Synonyms:
(2R,15S)-2,15-dimethyltetracyclo[8.7.0.0^{2,7}.0^{11,15}]heptadec-6-ene-5,14-dione Androst-4-ene-3,17-dione [1beta-3H] androstenedione
Type:
Small organic molecule
Emp. Form.:
C19H26O2
Mol. Mass.:
286.4085
SMILES:
C[C@]12CCC3C(CCC4=CC(=O)CC[C@]34C)C1CCC2=O
: