Target
Fatty acid-binding protein 5
Ligand
BDBM312343
Substrate
Meas. Tech.
Time Resolved-Fluorescence Energy Transfer (TR-FRET) Assay
IC50
80.0±n/a nM
Citation
 Buettelmann, BCeccarelli, SMKuehne, HKuhn, BNeidhart, WObst Sander, URichter, H Bicyclic thiophenylamide compounds US Patent  US9604977 Publication Date 3/28/2017 
Target
Name:
Fatty acid-binding protein 5
Synonyms:
FABP5 Fatty acid binding protein epidermal | Fatty acid-binding protein 5 (FABP5)
Type:
Enzyme
Mol. Mass.:
15164.79
Organism:
Homo sapiens (Human)
Description:
Q01469
Residue:
135
  
Inhibitor
Name:
BDBM312343
Synonyms:
2-[3-(4-Trifluoromethyl-thiazol-2-yl)-4,7-dihydro-5H-thieno[2,3-c]pyran-2-ylcarbamoyl]-cyclopent-1-enecarboxylic acid | US9604977, Example 89
Type:
Small organic molecule
Emp. Form.:
C18H15F3N2O4S2
Mol. Mass.:
444.448
SMILES:
OC(=O)C1=C(CCC1)C(=O)Nc1sc2COCCc2c1-c1nc(cs1)C(F)(F)F
: